Cinnamonitrile, 2-cyano, trans

Normal alkane RI, non-polar column, temperature ramp

View large format table.

Column type Active phase I Reference Comment
CapillaryZB-51531.Kluchinsky, Sheely, et al., 200230. m/0.25 mm/0.25 μm, He, 10. K/min, 200. C @ 2. min; Tstart: 40. C

References

Kluchinsky, Sheely, et al., 2002
Kluchinsky, T.A., Jr.; Sheely, M.V.; Savage, P.B.; Smith, P.A., Formation of 2-chlorobenzylidenemalononitrile (CS riot control agent) thermal degradation products at elevated temperatures, J. Chromatogr. A, 2002, 952, 1-2, 205-213, https://doi.org/10.1016/S0021-9673(02)00096-1 . [all data]