cis-10,11-epoxyhenicosane

Normal alkane RI, polar column, custom temperature program

View large format table.

Column type Active phase I Reference Comment
CapillaryHP-Innowax2484.Wakamura S., Arakaki N., et al., 2001Program: not specified

References

Wakamura S., Arakaki N., et al., 2001
Wakamura S.; Arakaki N.; Yamamoto M.; Hiradate S.; Yasui H.; Yasuda T.; Ando T., Posticlure: a novel trans-epoxide as a sex pheromone component of the tussock moth, Orgyia postica (Walker), Tetrahedron Lett., 2001, 42, 4, 687-689, https://doi.org/10.1016/S0040-4039(00)02038-4 . [all data]