2,2,5,5,6-exo,8c,9b,9c,10a,10b-decachlorobornane

Kovats' RI, non-polar column, custom temperature program

View large format table.

Column type Active phase I Reference Comment
CapillaryDB-5MS2685.McDonald J.G., Vetter W., et al., 200160. m/0.25 mm/0.25 μm, He; Program: 100C(1min) => 20C/min => 210C => 0.8C/min => 270C => 25C/min => 325C(10min)

References

McDonald J.G., Vetter W., et al., 2001
McDonald J.G.; Vetter W.; Hites R.A., Methylene retention indexes far isolated toxaphene congeners, Anal. Chem., 2001, 73, 6, 1374-1376, https://doi.org/10.1021/ac001119t . [all data]