(7R, 8S)-cis-7,8-epoxy-2-methyloctadecane [(+)-disparlure]

Normal alkane RI, non-polar column, custom temperature program

View large format table.

Column type Active phase I Reference Comment
CapillaryDB-52032.Gries, Schaefer, et al., 200130. m/0.25 mm/0.32 μm; Program: not specified

References

Gries, Schaefer, et al., 2001
Gries, G.; Schaefer, P.W.; Gries, R.; Liska, J.; Gotoh, T., Reproductive character displacement in Lymantria monacha from Northern Japan, J. Chem. Ecol., 2001, 27, 6, 1163-1176, https://doi.org/10.1023/A:1010316029165 . [all data]