2,6,10,14,18-Pentamethyl-13-(3-methyl-pent-4-enylidene)-nonadeca-2,6,10,17-tetraene, cis

Normal alkane RI, non-polar column, custom temperature program

Data compiled by: NIST Mass Spectrometry Data Center, William E. Wallace, director

Column type CapillaryCapillary
Active phase HP-1HP-5
Column length (m)
Carrier gas
Substrate
Column diameter (mm)
Phase thickness (μm)
Program not specifiednot specified
I 2545.2565.
ReferenceBelt, Allard, et al., 2001Belt, Allard, et al., 2001
Comment MSDC-RI MSDC-RI

References

Belt, Allard, et al., 2001
Belt, S.T.; Allard, W.G.; Massé, G.; Robert, J.-M.; Rowland, S.J., Structural characterisation of C30 highly branched isoprenoid alkenes (rhizenes) in the marine diatom Rhizosolenia setigera, Tetrahedron Lett., 2001, 42, 32, 5583-5585, https://doi.org/10.1016/S0040-4039(01)01063-2 . [all data]