Cyclopentane, 1-nonyl, 3-(3-methylpentadecyl)

Normal alkane RI, non-polar column, custom temperature program

Data compiled by: NIST Mass Spectrometry Data Center, William E. Wallace, director

Column type Capillary
Active phase Polydimethyl siloxane
Column length (m)
Carrier gas
Substrate
Column diameter (mm)
Phase thickness (μm)
Program not specified
I 2945.
ReferenceSchouten, Hopmans, et al., 2000
Comment MSDC-RI

References

Schouten, Hopmans, et al., 2000
Schouten, S.; Hopmans, E.C.; Pancost, R.D.; Damsté, J.S.S., Widespread occurrence of structurally diverse tetraether membrane lipids: evidence for the ubiquitous presence of low-temperature relatives of hyperthermophiles, Proc. Nat. Acad. Sci. U.S.A., 2000, 97, 26, 14421-14426, https://doi.org/10.1073/pnas.97.26.14421 . [all data]