Acetic acid 2-acetoxymethyl-5-(acetyl-methyl-amino)-3,6-dimethoxy-tetrahydro-pyran-4-yl ester

Van Den Dool and Kratz RI, non-polar column, temperature ramp

Data compiled by: NIST Mass Spectrometry Data Center, William E. Wallace, director

Column type Capillary
Active phase DB-5
Column length (m)
Carrier gas
Substrate
Column diameter (mm)
Phase thickness (μm)
Tstart (C) 80.
Tend (C) 300.
Heat rate (K/min) 2.
Initial hold (min)
Final hold (min)
I 2143.65
ReferenceElvebak, Smith, et al., 2000
Comment MSDC-RI

References

Elvebak, Smith, et al., 2000
Elvebak, L.E., II; Smith, S.O.; Gray, G.R., Authentic standards for the reductive-cleavage method. The positional isomers of partially methylated and acetylated or benzoylated methyl 2-(acetylmethylamino)-2-deoxy-β-D-glucopyranoside, Carbohyd. Res., 2000, 329, 4, 799-805, https://doi.org/10.1016/S0008-6215(00)00260-3 . [all data]