5β,17β-Dihydrotestosterone propanoate

Kovats' RI, non-polar column, isothermal

Data compiled by: NIST Mass Spectrometry Data Center, William E. Wallace, director

Column type CapillaryCapillary
Active phase DB-1DB-1
Column length (m) 30.30.
Carrier gas H2H2
Substrate
Column diameter (mm) 0.250.25
Phase thickness (μm) 0.250.25
Temperature (C) 215.222.
I 2677.852690.55
ReferenceStránsky, Sídová, et al., 1998Stránsky, Sídová, et al., 1998
Comment MSDC-RI MSDC-RI

References

Stránsky, Sídová, et al., 1998
Stránsky, K.; Sídová, R.; Kohout, L., Gas chromatography of esters of dihydrotestosterone and dihydroepitestosterone, J. Hi. Res. Chromatogr., 1998, 21, 7, 417-420, https://doi.org/10.1002/(SICI)1521-4168(19980701)21:7<417::AID-JHRC417>3.0.CO;2-B . [all data]