GA73 Methyl ester, [D2]

Normal alkane RI, non-polar column, custom temperature program

View large format table.

Column type Active phase I Reference Comment
CapillaryDB-12328.Yamauchi, Oyama, et al., 1997Helium; Column length: 15. m; Column diameter: 0.258 mm; Program: 120 0C (2 min) 6 0C/min -> 216 0C (5 min) 8 0C/min -> 280 0C

References

Yamauchi, Oyama, et al., 1997
Yamauchi, T.; Oyama, N.; Yamane, H.; Mirofushi, N.; Schraudoff, H.; Pour, M.; Seto, H.; Mander, L.N., Biosynthesis of GA73 Methyl Ester in Lygodium Ferns, Plant Physiol., 1997, 113, 773-778. [all data]