5,6-epoxy-cholesterol, TMS

Van Den Dool and Kratz RI, non-polar column, temperature ramp

View large format table.

Column type Active phase I Reference Comment
CapillaryDB-13209.Meyer and Spiteller, 199730. m/0.32 mm/0.1 μm, H2, 80. C @ 3. min, 3. K/min, 280. C @ 15. min

References

Meyer and Spiteller, 1997
Meyer, W.; Spiteller, G., Oxidized phytosterols increase by ageing in photoautotrophic cell cultures of Chenopodium rubrum, Phytochemistry, 1997, 45, 2, 297-302, https://doi.org/10.1016/S0031-9422(96)00818-7 . [all data]