Benzenepropanol, 3-methoxy-4-(1-hydroxymethyl-2-(4-hydroxy-3-methoxyphenyl))ethyl, tris-TMS

Kovats' RI, non-polar column, temperature ramp

View large format table.

Column type Active phase I Reference Comment
CapillaryDB-13014.Kraus and Spiteller, 199730. m/0.32 mm/0.10 μm, H2, 3. K/min; Tstart: 80. C; Tend: 280. C

References

Kraus and Spiteller, 1997
Kraus, C.; Spiteller, G., Comparison of phenolic compounds from galls and shoots of Picea glauca, Phytochemistry, 1997, 44, 1, 59-67, https://doi.org/10.1016/S0031-9422(96)00388-3 . [all data]