2-pentyl-4,5-dimethyl-3-thiazoline, trans

Van Den Dool and Kratz RI, polar column, custom temperature program

Data compiled by: NIST Mass Spectrometry Data Center, William E. Wallace, director

Column type Capillary
Active phase BP-20
Column length (m) 50.
Carrier gas He
Substrate
Column diameter (mm) 0.32
Phase thickness (μm) 0.5
Program 0C (10min) => 40C/min => 40C (2min) => 4C/min => 250C
I 1787.
ReferenceElmore, Mottram, et al., 1997
Comment MSDC-RI

References

Elmore, Mottram, et al., 1997
Elmore, J.S.; Mottram, D.S.; Enser, M.; Wood, J.D., Novel thiazoles and 3-thiazolines in cooked beef aroma, J. Agric. Food Chem., 1997, 45, 9, 3603-3607, https://doi.org/10.1021/jf970066m . [all data]