2-nonyl-4,5-dimethyl-3-thiazoline, cis

Van Den Dool and Kratz RI, non-polar column, temperature ramp

Data compiled by: NIST Mass Spectrometry Data Center, William E. Wallace, director

Column type Capillary
Active phase BPX-5
Column length (m) 50.
Carrier gas He
Substrate
Column diameter (mm) 0.32
Phase thickness (μm) 0.5
Tstart (C) 60.
Tend (C) 280.
Heat rate (K/min) 10.
Initial hold (min) 2.
Final hold (min)
I 1824.
ReferenceElmore and Mottram, 1997
Comment MSDC-RI

Van Den Dool and Kratz RI, polar column, custom temperature program

Data compiled by: NIST Mass Spectrometry Data Center, William E. Wallace, director

Column type Capillary
Active phase BP-20
Column length (m) 50.
Carrier gas He
Substrate
Column diameter (mm) 0.32
Phase thickness (μm) 0.5
Program 0C (10min) => 40C/min => 40C (2min) => 4C/min => 250C
I 2199.
ReferenceElmore, Mottram, et al., 1997
Comment MSDC-RI

References

Elmore and Mottram, 1997
Elmore, J.S.; Mottram, D.S., Investigation of the reaction between ammonium sulfide, aldehydes, and α-dicarbonyls to form some lipid-Maillard interaction products found in cooked beef, J. Agric. Food Chem., 1997, 45, 9, 3595-3602, https://doi.org/10.1021/jf970065u . [all data]