2-Deoxybrassinolide, methaneboronate-TMS

Kovats' RI, non-polar column, custom temperature program

Data compiled by: NIST Mass Spectrometry Data Center, William E. Wallace, director

Column type CapillaryCapillary
Active phase DB-1DB-1
Column length (m) 15.15.
Carrier gas HeHe
Substrate
Column diameter (mm) 0.250.25
Phase thickness (μm) 0.250.25
Program 170C(1.5min) => 37C/min => 280C => 1.5C/min => 300C170C(1.5min) => 37C/min => 280C => 1.5C/min => 300C
I 3756.3757.
ReferenceYokota, Matsuoka, et al., 1996Yokota, Matsuoka, et al., 1996
Comment MSDC-RI MSDC-RI

References

Yokota, Matsuoka, et al., 1996
Yokota, T.; Matsuoka, T.; Koarai, T.; Nakayama, M., 2-Deoxybrassinolide, a brassinosteroid from Pisum sativum seed, Phytochemistry, 1996, 42, 2, 509-511, https://doi.org/10.1016/0031-9422(95)00937-X . [all data]