6-Deoxocastasterone, methaneboronate

Kovats' RI, non-polar column, custom temperature program

View large format table.

Column type Active phase I Reference Comment
CapillaryDB-13429.Yokota, Matsuoka, et al., 199615. m/0.25 mm/0.25 μm, He; Program: 170C(1.5min) => 37C/min => 280C => 1.5C/min => 300C
CapillaryDB-13429.Yokota, Matsuoka, et al., 199615. m/0.25 mm/0.25 μm, He; Program: 170C(1.5min) => 37C/min => 280C => 1.5C/min => 300C
CapillaryDB-13430.Yokota, Matsuoka, et al., 199615. m/0.25 mm/0.25 μm, He; Program: 170C(1.5min) => 37C/min => 280C => 1.5C/min => 300C
CapillaryDB-13433.Yokota, Matsuoka, et al., 199615. m/0.25 mm/0.25 μm, He; Program: 170C(1.5min) => 37C/min => 280C => 1.5C/min => 300C

References

Yokota, Matsuoka, et al., 1996
Yokota, T.; Matsuoka, T.; Koarai, T.; Nakayama, M., 2-Deoxybrassinolide, a brassinosteroid from Pisum sativum seed, Phytochemistry, 1996, 42, 2, 509-511, https://doi.org/10.1016/0031-9422(95)00937-X . [all data]