6-Undecyl nitrate

Normal alkane RI, non-polar column, temperature ramp

View large format table.

Column type Active phase I Reference Comment
CapillaryDB-11411.Schneider and Ballschniter, 199640. C @ 3. min, 3. K/min; Tend: 250. C

References

Schneider and Ballschniter, 1996
Schneider, M.; Ballschniter, K., Separation of Diastereomeric and Enentiomeric Alkyl Nitrates - Systematic Approach to Chiral Discrimination on Cyclodextrin LIPODEX-D, Chem. Eur. J., 1996, 2, 5, 539-544, https://doi.org/10.1002/chem.19960020513 . [all data]