5β-Androst-1-ene-3,17-dione, mono-TMS

Normal alkane RI, non-polar column, temperature ramp

View large format table.

Column type Active phase I Reference Comment
CapillarySE-542452.Schänzer and Donike, 199220. m/0.25 mm/0.33 μm, He, 5. K/min; Tstart: 200. C; Tend: 300. C
CapillarySE-542468.Schänzer and Donike, 199215. m/0.2 mm/0.33 μm, He, 5. K/min; Tstart: 200. C; Tend: 300. C

References

Schänzer and Donike, 1992
Schänzer, W.; Donike, M., Metabolism of boldenone in man: gas chromatographic/mass spectrometric identification of urinary excreted metabolites and determination of excretion rates, Biol. Mass Spectrom., 1992, 21, 1, 3-16, https://doi.org/10.1002/bms.1200210104 . [all data]