1-(Propylthio)1-propanethiol

Van Den Dool and Kratz RI, non-polar column, temperature ramp

View large format table.

Column type Active phase I Reference Comment
CapillaryUltra-11079.0Farkas, Hradský, et al., 199225. m/0.2 mm/0.33 μm, H2, 2. K/min; Tstart: 60. C; Tend: 230. C

References

Farkas, Hradský, et al., 1992
Farkas, P.; Hradský, P.; Kovác, M., Novel flavour components identified in the steamn distillate of onion (Allium cepa L.), Z. Lebensm. Unters. Forsch., 1992, 195, 5, 459-462, https://doi.org/10.1007/BF01191718 . [all data]