2,4,6-Triethyl-1,3,5-trithiane

Van Den Dool and Kratz RI, non-polar column, temperature ramp

View large format table.

Column type Active phase I Reference Comment
CapillaryUltra-11560.7Farkas, Hradský, et al., 199225. m/0.2 mm/0.33 μm, H2, 2. K/min; Tstart: 60. C; Tend: 230. C

Normal alkane RI, polar column, temperature ramp

View large format table.

Column type Active phase I Reference Comment
CapillaryFFAP2040.Vernin, Metzger, et al., 199360. C @ 8. min, 2. K/min; Column length: 50. m; Column diameter: 0.22 mm; Tend: 230. C

References

Farkas, Hradský, et al., 1992
Farkas, P.; Hradský, P.; Kovác, M., Novel flavour components identified in the steamn distillate of onion (Allium cepa L.), Z. Lebensm. Unters. Forsch., 1992, 195, 5, 459-462, https://doi.org/10.1007/BF01191718 . [all data]

Vernin, Metzger, et al., 1993
Vernin, G.; Metzger, J.; Sultan, A.A.M.; El-Shafei, A.K.; Párkányi, C., Heterocyclic compounds in model systems for the Maillard reaction. Reactions of aldehydes with ammonium sulfide in the presence or absence of acetoin, Am. Chem. Soc. Symp. Ser., 1993, 528, 36-55. [all data]