7α,12α-dihydroxy, 3-oxy-4-cholenoate, methyl ester-trimethylsilyl ether

Kovats' RI, non-polar column, custom temperature program

Data compiled by: NIST Mass Spectrometry Data Center, William E. Wallace, director

Column type Capillary
Active phase SE-30
Column length (m) 30.
Carrier gas
Substrate
Column diameter (mm) 0.32
Phase thickness (μm) 0.25
Program 50C(6min) => rapidly => 190C => 5C/min => 285C
I 3360.
ReferenceAxelson, Mörk, et al., 1991
Comment MSDC-RI

References

Axelson, Mörk, et al., 1991
Axelson, M.; Mörk, B.; Everson, G.T., Bile Acid Synthesis in Cultured Human Hepatoblastoma Cells, J. Biol. Chem., 1991, 266, 27, 17770-17777. [all data]