butyl 4-methylnonanoate

Normal alkane RI, polar column, temperature ramp

Data compiled by: NIST Mass Spectrometry Data Center, William E. Wallace, director

Column type Capillary
Active phase Supelcowax-10
Column length (m) 60.
Carrier gas He
Substrate
Column diameter (mm) 0.32
Phase thickness (μm) 0.25
Tstart (C) 50.
Tend (C) 230.
Heat rate (K/min) 2.
Initial hold (min) 15.
Final hold (min)
I 1754.
ReferenceHa and Lindsay, 1989
Comment MSDC-RI

References

Ha and Lindsay, 1989
Ha, J.K.; Lindsay, R.C., Mass spectra of butyl esters of volatile branched-chain and other fatty acids occurring in milkfat and meat lipids, J. Food Comp. Anal., 1989, 2, 2, 118-131, https://doi.org/10.1016/0889-1575(89)90072-0 . [all data]