7α-hydroxy-3-oxo-4-chol-24-oate, TMS

Normal alkane RI, non-polar column, custom temperature program

View large format table.

Column type Active phase I Reference Comment
CapillarySE-303295.Axelson, Mörk, et al., 198830. m/0.32 mm/0.25 μm; Program: 50C(6min) => rapid increase => 190C => 5C/min => 285C

References

Axelson, Mörk, et al., 1988
Axelson, M.; Mörk, B.; Sjövall, J., Occurrence of 3β-hydroxy-5-cholestenoic acid, 3β,7α-dihydroxy-5-cholestenoic acid, and 7α-hydroxy-3-oxo-4-cholestenoic acid as normal constituents in human blood, J. Lipid Res., 1988, 29, 629-641. [all data]