3-oxo-4,6-chol-24-oate, TMS

Normal alkane RI, non-polar column, custom temperature program

Data compiled by: NIST Mass Spectrometry Data Center, William E. Wallace, director

Column type Capillary
Active phase SE-30
Column length (m) 30.
Carrier gas
Substrate
Column diameter (mm) 0.32
Phase thickness (μm) 0.25
Program 50C(6min) => rapid increase => 190C => 5C/min => 285C
I 3270.
ReferenceAxelson, Mörk, et al., 1988
Comment MSDC-RI

References

Axelson, Mörk, et al., 1988
Axelson, M.; Mörk, B.; Sjövall, J., Occurrence of 3β-hydroxy-5-cholestenoic acid, 3β,7α-dihydroxy-5-cholestenoic acid, and 7α-hydroxy-3-oxo-4-cholestenoic acid as normal constituents in human blood, J. Lipid Res., 1988, 29, 629-641. [all data]