2,3,7,7-tetramethylcyclohepta-1,3,5-triene

Kovats' RI, non-polar column, isothermal

Data compiled by: NIST Mass Spectrometry Data Center, William E. Wallace, director

Column type Capillary
Active phase Squalane
Column length (m) 50.
Carrier gas N2
Substrate
Column diameter (mm) 0.25
Phase thickness (μm)
Temperature (C) 70.
I 1040.
ReferenceUdarov, Manukov, et al., 1987
Comment MSDC-RI

References

Udarov, Manukov, et al., 1987
Udarov, B.G.; Manukov, E.N.; Vyglazov, O.G.; Chuiko, V.A.; Izotova, L.V., Gas-chromatographic analysis of alkylated derivatives of carane and of cyclohelptane in capillary columns, Chem. Nat. Compd. (Engl. Transl.), 1987, 22, 4, 398-403, https://doi.org/10.1007/BF00579809 . [all data]