1,5,5-trimethylcycloheptene

Kovats' RI, non-polar column, isothermal

View large format table.

Column type Active phase Temperature (C) I Reference Comment
CapillarySqualane70.989.Udarov, Manukov, et al., 1987N2; Column length: 50. m; Column diameter: 0.25 mm

References

Udarov, Manukov, et al., 1987
Udarov, B.G.; Manukov, E.N.; Vyglazov, O.G.; Chuiko, V.A.; Izotova, L.V., Gas-chromatographic analysis of alkylated derivatives of carane and of cyclohelptane in capillary columns, Chem. Nat. Compd. (Engl. Transl.), 1987, 22, 4, 398-403, https://doi.org/10.1007/BF00579809 . [all data]