3-vinylfuran

Van Den Dool and Kratz RI, polar column, temperature ramp

View large format table.

Column type Active phase I Reference Comment
CapillaryCP-WAX 57CB1143.Baltes and Mevissen, 1988He, 50. C @ 5. min, 2. K/min; Column length: 50. m; Column diameter: 0.24 mm; Tend: 210. C

Van Den Dool and Kratz RI, polar column, custom temperature program

View large format table.

Column type Active phase I Reference Comment
CapillaryCarbowax1147.Baltes w. and Bochmann G., 1987Column diameter: 0.3 mm; Program: not specified
CapillaryCarbowax1148.Baltes w. and Bochmann G., 1987Column diameter: 0.3 mm; Program: not specified
CapillaryCarbowax1148.Baltes w. and Bochmann G., 1987Column diameter: 0.3 mm; Program: not specified
CapillaryCarbowax1149.Baltes w. and Bochmann G., 1987Column diameter: 0.3 mm; Program: not specified

References

Baltes and Mevissen, 1988
Baltes, W.; Mevissen, L., Model reactions on roast aroma formation. VI. Volatile reaction products from the reaction of phenylalanine with glucose during cooking and roasting, Z. Lebensm. Unters. Forsch., 1988, 187, 3, 209-214, https://doi.org/10.1007/BF01043341 . [all data]

Baltes w. and Bochmann G., 1987
Baltes w.; Bochmann G., Model reactions on roast aroma formation. II. Mass spectrometric identification of furans and furanones from the reaction of serine and threonine with sucrose under the conditions of coffee roasting, Z. Lebensm. Unters. Forsch., 1987, 184, 179-186. [all data]