3,3'-dimethyl-4-oxo-1,2-dithiolane

Normal alkane RI, polar column, temperature ramp

View large format table.

Column type Active phase I Reference Comment
CapillaryCarbowax 20M1850.Tressl and Silwar, 1981He, 2. K/min; Column length: 50. m; Column diameter: 0.25 mm; Tstart: 70. C; Tend: 180. C

References

Tressl and Silwar, 1981
Tressl, R.; Silwar, R., Investigation of sulfur-containing components in roasted coffee, J. Agric. Food Chem., 1981, 29, 5, 1078-1082, https://doi.org/10.1021/jf00107a045 . [all data]