Isopropyl (Z)-7-dodecenoate

Normal alkane RI, polar column, isothermal

Data compiled by: NIST Mass Spectrometry Data Center, William E. Wallace, director

Column type Capillary
Active phase WG-11
Column length (m)
Carrier gas
Substrate
Column diameter (mm)
Phase thickness (μm)
Temperature (C) 150.
I 1876.
ReferenceFrancke, Levinson, et al., 1979
Comment MSDC-RI

References

Francke, Levinson, et al., 1979
Francke, W.; Levinson, A.R.; Jen, T.-L.; Levinson, H.Z., Isopropyl Carboxylates - a New Class of Insect Pheromones, Angew Chem. Int. Ed. Engl., 1979, 18, 10, 796-797, https://doi.org/10.1002/anie.197907961 . [all data]