Isopropyl 11-dodecenoate

Normal alkane RI, polar column, isothermal

View large format table.

Column type Active phase Temperature (C) I Reference Comment
CapillaryWG-11150.1893.Francke, Levinson, et al., 1979

References

Francke, Levinson, et al., 1979
Francke, W.; Levinson, A.R.; Jen, T.-L.; Levinson, H.Z., Isopropyl Carboxylates - a New Class of Insect Pheromones, Angew Chem. Int. Ed. Engl., 1979, 18, 10, 796-797, https://doi.org/10.1002/anie.197907961 . [all data]