5β-pregnane-3α,17,20α-triol, MO-TMS

Van Den Dool and Kratz RI, non-polar column, temperature ramp

View large format table.

Column type Active phase I Reference Comment
CapillaryOV-12889.Bègue, Dumas, et al., 1979He, 1. K/min; Tstart: 180. C; Tend: 250. C

References

Bègue, Dumas, et al., 1979
Bègue, R.-J.; Dumas, M.; Morinière, M.; Nivois, C.; Padieu, P., Steroids and hypertension. 1-Gas-liquid chromatography and gas chromatography mass spectrometry of 3,15- and 3,16-dihydroxy-17-oxosteroids, Biomed. Mass Spectrom., 1979, 6, 11, 476-481, https://doi.org/10.1002/bms.1200061104 . [all data]