Benzo[b]-7-oxa-bicyclo[2,2,2]oct-2-en-5(endo),6(exo)-dicarboxylic acid, 4-methyl-1-phenyl, dimethyl ester

Normal alkane RI, polar column, isothermal

View large format table.

Column type Active phase Temperature (C) I Reference Comment
PackedCarbowax 20M190.2837.Karasek, Tchir, et al., 1978H2, Chromosorb W; Column length: 1.8 m

References

Karasek, Tchir, et al., 1978
Karasek, F.W.; Tchir, M.F.; Bowers, W.D., Separation and identification of cis-trans isomeric dimethyl esters by a gas chromatography-mass spectrometry-calculator system, J. Chromatogr., 1978, 151, 3, 321-330, https://doi.org/10.1016/S0021-9673(00)88347-8 . [all data]