δ1-tetrahydrocannabinolic acid, methyl-boronate

Van Den Dool and Kratz RI, non-polar column, temperature ramp

View large format table.

Column type Active phase I Reference Comment
PackedSE-302725.Harvey, 1977N2, Gas Chrom Q, 4. K/min; Column length: 2. m; Tstart: 100. C; Tend: 330. C

References

Harvey, 1977
Harvey, D.J., Cyclic alkylboronates as derivatives for the characterization of cannabinolic acids by combined gas chromatography and mass spectrometry, Biomed. Mass Spectrom., 1977, 4, 2, 88-93, https://doi.org/10.1002/bms.1200040206 . [all data]