epi-Me-dihydrophaseic acid

Kovats' RI, non-polar column, isothermal

View large format table.

Column type Active phase Temperature (C) I Reference Comment
PackedSE-30202.2126.Zeevaart and Milborrow, 1976Gas-Chrom Q; Column length: 1.8 m

References

Zeevaart and Milborrow, 1976
Zeevaart, J.A.D.; Milborrow, B.V., Metabolism of abscisic acid and the occurence of epi-dihydrophaseic acid in Phaseolus vulgaris, Phytochemistry, 1976, 15, 4, 493-500, https://doi.org/10.1016/S0031-9422(00)88955-4 . [all data]