2,4-Dimethyl-3,4-dihydro-2H-thiopyran-3-carbaldehyde

Kovats' RI, non-polar column, isothermal

View large format table.

Column type Active phase Temperature (C) I Reference Comment
PackedSE-30110.1210.Badings, Maarse, et al., 1976Chromosorb W-AW; Column length: 2. m

References

Badings, Maarse, et al., 1976
Badings, H.T.; Maarse, H.; Kleipool, R.J.C.; Tas, A.C.; Neeter, R.; ten Noever de Brauw, M.C., Formation of odorous compounds from hydrogen sulphide and 2-butenal, Z. Lebensm. Unters. Forsch., 1976, 161, 1, 53-59, https://doi.org/10.1007/BF01145420 . [all data]