5-β-Pregnan-3-β,11-β-diol-20-one, MO-TMS

Normal alkane RI, non-polar column, custom temperature program

Data compiled by: NIST Mass Spectrometry Data Center, William E. Wallace, director

Column type Capillary
Active phase Polydimethyl siloxane
Column length (m)
Carrier gas
Substrate
Column diameter (mm)
Phase thickness (μm)
Program not specified
I 2860.
ReferenceVandenheuvel, 1975
Comment MSDC-RI

References

Vandenheuvel, 1975
Vandenheuvel, F.A., Gas-liquid chromatographic studies of reactions and structural relationships of steroids, J. Chromatogr., 1975, 103, 1, 113-134, https://doi.org/10.1016/S0021-9673(00)83806-6 . [all data]