5-β-Pregnan-11-β,20-α-diol, TMS

Normal alkane RI, non-polar column, custom temperature program

View large format table.

Column type Active phase I Reference Comment
CapillaryPolydimethyl siloxane2698.Vandenheuvel, 1975Program: not specified

References

Vandenheuvel, 1975
Vandenheuvel, F.A., Gas-liquid chromatographic studies of reactions and structural relationships of steroids, J. Chromatogr., 1975, 103, 1, 113-134, https://doi.org/10.1016/S0021-9673(00)83806-6 . [all data]