(Z)-2-Hexenyl butyrate

Van Den Dool and Kratz RI, non-polar column, custom temperature program

Data compiled by: NIST Mass Spectrometry Data Center, William E. Wallace, director

Column type Capillary
Active phase DB-5
Column length (m) 30.
Carrier gas
Substrate
Column diameter (mm) 0.25
Phase thickness (μm) 0.25
Program 40C(2min) => 4C/min => 220C => 20C/min => 280C
I 1103.
ReferenceSampaio and Nogueira, 2006
Comment MSDC-RI

Kovats' RI, non-polar column, isothermal

Data compiled by: NIST Mass Spectrometry Data Center, William E. Wallace, director

Column type Packed
Active phase SE-30
Column length (m) 3.7
Carrier gas He
Substrate Celatom silanized (62-72 mesh)
Column diameter (mm)
Phase thickness (μm)
Temperature (C) 150.
I 1152.
ReferenceAshes and Haken, 1975
Comment MSDC-RI

References

Sampaio and Nogueira, 2006
Sampaio, T.S.; Nogueira, P.C.L., Volatile components of mangaba fruit (Hancornia speciosa Gomes) at three stages of maturity, Food Chem., 2006, 95, 4, 606-610, https://doi.org/10.1016/j.foodchem.2005.01.038 . [all data]