3B,16A-Dihydroxy-5-androsten-17-one, MO TMS

Van Den Dool and Kratz RI, non-polar column, temperature ramp

Data compiled by: NIST Mass Spectrometry Data Center, William E. Wallace, director

Column type PackedCapillaryCapillaryPacked
Active phase OV-1OV-1SE-30SE-30
Column length (m) 20.20.20.20.
Carrier gas HeHeHeHe
Substrate
Column diameter (mm) 0.250.250.250.25
Phase thickness (μm)
Tstart (C) 180.220.200.180.
Tend (C)
Heat rate (K/min) 1.1.1.1.
Initial hold (min)
Final hold (min)
I 2732.2768.2774.2743.
ReferenceLuyten and Rutten, 1974Luyten and Rutten, 1974Luyten and Rutten, 1974Luyten and Rutten, 1974
Comment MSDC-RI MSDC-RI MSDC-RI MSDC-RI

References

Luyten and Rutten, 1974
Luyten, J.A.; Rutten, G.A.F.M., Analysis of Steroids by High-Resolution Gas-Liquid Chromatography. II. Application to Urinary Samples, J. Chromatogr., 1974, 91, 393-406, https://doi.org/10.1016/S0021-9673(01)97918-X . [all data]