Hexadecane, 7-heptyl

Van Den Dool and Kratz RI, non-polar column, temperature ramp

Data compiled by: NIST Mass Spectrometry Data Center, William E. Wallace, director

Column type Capillary
Active phase DB-1
Column length (m)
Carrier gas
Substrate
Column diameter (mm)
Phase thickness (μm)
Tstart (C) 35.
Tend (C) 300.
Heat rate (K/min) 3.
Initial hold (min) 3.
Final hold (min)
I 2160.
ReferenceKhorasheh, Gray, et al., 1989
Comment MSDC-RI

References

Khorasheh, Gray, et al., 1989
Khorasheh, F.; Gray, M.R.; Selucky, M.L., Correlation for Kováts retention index of C9-C26 monoalkyl and polymethyl alkanes and alkenes, J. Chromatogr., 1989, 481, 1-16, https://doi.org/10.1016/S0021-9673(01)96747-0 . [all data]