Benzaldehyde, 5,6-dichloro-2-hydroxy

Van Den Dool and Kratz RI, non-polar column, temperature ramp

Data compiled by: NIST Mass Spectrometry Data Center, William E. Wallace, director

Column type CapillaryCapillaryCapillary
Active phase SE-30SE-30SE-30
Column length (m) 25.25.25.
Carrier gas
Substrate
Column diameter (mm) 0.30.30.3
Phase thickness (μm)
Tstart (C) 100.100.100.
Tend (C)
Heat rate (K/min) 10.2.6.
Initial hold (min)
Final hold (min)
I 1359.1342.1357.
ReferenceKorhonen, 1984Korhonen, 1984Korhonen, 1984
Comment MSDC-RI MSDC-RI MSDC-RI

References

Korhonen, 1984
Korhonen, I.O.O., Gas-liquid chromatographic analyses. XXX. Separation and retention increments of chlorinated salicylaldehydes (2-hydroxybenzaldehydes ) on low-polarity (SE-30) and polar (OV-351) capillary columns, J. Chromatogr., 1984, 298, 101-114, https://doi.org/10.1016/S0021-9673(01)92698-6 . [all data]