2,3,6-trichloro-4-hydroxybenzaldehyde

Kovats' RI, non-polar column, isothermal

View large format table.

Column type Active phase Temperature (C) I Reference Comment
CapillarySE-30160.1651.Evans and Haken, 1989Column length: 25. m; Column diameter: 0.32 mm
CapillarySE-30160.1651.Korhonen and Knuutinen, 1984N2; Column length: 25. m; Column diameter: 0.3 mm
CapillarySE-30180.1664.Korhonen and Knuutinen, 1984N2; Column length: 25. m; Column diameter: 0.3 mm
CapillarySE-30200.1675.Korhonen and Knuutinen, 1984N2; Column length: 25. m; Column diameter: 0.3 mm

Van Den Dool and Kratz RI, non-polar column, temperature ramp

View large format table.

Column type Active phase I Reference Comment
CapillarySE-301672.Korhonen and Knuutinen, 1984N2, 10. K/min; Column length: 25. m; Column diameter: 0.3 mm; Tstart: 100. C
CapillarySE-301678.Korhonen and Knuutinen, 1984N2, 14. K/min; Column length: 25. m; Column diameter: 0.3 mm; Tstart: 100. C
CapillarySE-301665.Korhonen and Knuutinen, 1984N2, 6. K/min; Column length: 25. m; Column diameter: 0.3 mm; Tstart: 100. C

Normal alkane RI, non-polar column, custom temperature program

View large format table.

Column type Active phase I Reference Comment
CapillaryMethyl Silicone1651.Feng, Yue, et al., 2006Program: not specified

References

Evans and Haken, 1989
Evans, M.B.; Haken, J.K., Dispersion and selectivity indices in gas chromatography. IV. Chlorinated aromatic compounds, J. Chromatogr., 1989, 468, 373-382, https://doi.org/10.1016/S0021-9673(00)96332-5 . [all data]

Korhonen and Knuutinen, 1984
Korhonen, I.O.O.; Knuutinen, J., Gas-liquid chromatographic analyses. XXVII. Separation of chlorinated 4-hydroxybenzaldehydes on a capillary column coated with non-polar SE-30 stationary phase, J. Chromatogr., 1984, 292, 2, 345-353, https://doi.org/10.1016/S0021-9673(01)83614-1 . [all data]

Feng, Yue, et al., 2006
Feng, C.-J.; Yue, W.; Li, M.-J., Estimation of chromatographic retention index of chlorinated hydroxybenzaldehyde by correlation indexes, Chem. Ind. Engineering, 2006, 23, 6, 486-490. [all data]