1,2,4,5-Tetrathiane, 3,6-dimethyl, #1

Van Den Dool and Kratz RI, non-polar column, temperature ramp

View large format table.

Column type Active phase I Reference Comment
CapillaryDB-11343.Zhang and Ho, 198960. m/0.25 mm/0.25 μm, He, 2. K/min, 220. C @ 10. min; Tstart: 40. C
CapillaryDB-11343.Zhang, Chien, et al., 198860. m/0.25 mm/0.25 μm, He, 2. K/min, 220. C @ 10. min; Tstart: 40. C

References

Zhang and Ho, 1989
Zhang, Y.; Ho, C.-T., Volatile compounds formed from thermnal interaction of 2,4-decadienal with cysteine and glutathione, J. Agric. Food Chem., 1989, 37, 4, 1016-1020, https://doi.org/10.1021/jf00088a044 . [all data]

Zhang, Chien, et al., 1988
Zhang, Y.; Chien, M.; Ho.C.-T., Comparison of the volatile compounds obtained from thermal degradation of cysteine and glutathione in water, J. Agric. Food Chem., 1988, 36, 5, 992-996, https://doi.org/10.1021/jf00083a022 . [all data]