Adamantane, 2-(1-piperazinyl)

Kovats' RI, non-polar column, isothermal

Data compiled by: NIST Mass Spectrometry Data Center, William E. Wallace, director

Column type Capillary
Active phase OV-101
Column length (m) 50.
Carrier gas N2
Substrate
Column diameter (mm) 0.25
Phase thickness (μm)
Temperature (C) 200.
I 1849.
ReferenceSuslov, Rudenko, et al., 1988
Comment MSDC-RI

References

Suslov, Rudenko, et al., 1988
Suslov, I.A.; Rudenko, B.A.; Arzamastsev, A.P., Capillary chromatography of adamantane derivatives, Zh. Anal. Khim., 1988, 43, 328-332. [all data]