Adamantan-4-one, 1-chloro

Kovats' RI, non-polar column, isothermal

View large format table.

Column type Active phase Temperature (C) I Reference Comment
CapillaryOV-101200.1483.Suslov, Rudenko, et al., 1988N2; Column length: 50. m; Column diameter: 0.25 mm

References

Suslov, Rudenko, et al., 1988
Suslov, I.A.; Rudenko, B.A.; Arzamastsev, A.P., Capillary chromatography of adamantane derivatives, Zh. Anal. Khim., 1988, 43, 328-332. [all data]