Benzoic acid, 3-chloro-2-hydroxy, TMS

Kovats' RI, non-polar column, isothermal

Data compiled by: NIST Mass Spectrometry Data Center, William E. Wallace, director

Column type Capillary
Active phase SE-30
Column length (m) 20.
Carrier gas
Substrate
Column diameter (mm) 0.2
Phase thickness (μm)
Temperature (C) 180.
I 1659.
ReferenceShakirov, Tsypysheva, et al., 1988
Comment MSDC-RI

References

Shakirov, Tsypysheva, et al., 1988
Shakirov, L.G.; Tsypysheva, L.G.; Suleimamova, R.A.; Naimushin, A.I.; Tsypyshev, O.Yu., Gas chromatographic determination of the products of the synthesis of chlorine-substituted salicylic acids, Zh. Anal. Khim., 1988, 43, 143-146. [all data]