5-ethyl-5-methoxy-2(5 H)furanone

Van Den Dool and Kratz RI, non-polar column, temperature ramp

Data compiled by: NIST Mass Spectrometry Data Center, William E. Wallace, director

Column type Capillary
Active phase DB-5
Column length (m) 60.
Carrier gas
Substrate
Column diameter (mm) 0.32
Phase thickness (μm) 1.
Tstart (C) 40.
Tend (C) 260.
Heat rate (K/min) 4.
Initial hold (min) 2.
Final hold (min) 10.
I 1080.
ReferenceMethven L., Tsoukka M., et al., 2007
Comment MSDC-RI

References

Methven L., Tsoukka M., et al., 2007
Methven L.; Tsoukka M.; Oruna-Concha M.J.; Parker J.K.; Mottram D.S., Influence of sulfur amino acids on the volatile and nonvolatile components of cooked salmon (Salmo salar), J. Agric. Food Chem., 2007, 55, 4, 1427-1436, https://doi.org/10.1021/jf0625611 . [all data]