Santalene (minor)

Kovats' RI, non-polar column, isothermal

Data compiled by: NIST Mass Spectrometry Data Center, William E. Wallace, director

Column type Packed
Active phase SE-30
Column length (m)
Carrier gas He
Substrate Chromosorb G
Column diameter (mm)
Phase thickness (μm)
Temperature (C) 130.
I 1441.
ReferenceAndersen and Falcone, 1969
Comment MSDC-RI

References

Andersen and Falcone, 1969
Andersen, N.H.; Falcone, M.S., The identification of sesquiterpene hydrocarbons from gas-liquid chromatography retention data, J. Chromatogr., 1969, 44, 52-59, https://doi.org/10.1016/S0021-9673(01)92497-5 . [all data]