S-(+)-1-Octen-3-ol

Van Den Dool and Kratz RI, non-polar column, temperature ramp

Data compiled by: NIST Mass Spectrometry Data Center, William E. Wallace, director

Column type Capillary
Active phase CP Sil 5 CB
Column length (m) 25.
Carrier gas He
Substrate
Column diameter (mm) 0.25
Phase thickness (μm) 0.4
Tstart (C) 80.
Tend (C) 270.
Heat rate (K/min) 10.
Initial hold (min)
Final hold (min)
I 962.
ReferenceZiegenbein, Hanssen, et al., 2006
Comment MSDC-RI

References

Ziegenbein, Hanssen, et al., 2006
Ziegenbein, F.C.; Hanssen, H.-P.; König, W.A., Chemical constituents of the essential oils of three wood-rotting fungi, Flavour Fragr. J., 2006, 21, 5, 813-816, https://doi.org/10.1002/ffj.1732 . [all data]