MALTOSE 8TMS-2

Van Den Dool and Kratz RI, non-polar column, temperature ramp

View large format table.

Column type Active phase I Reference Comment
CapillaryDB-5MS2748.Umeå Plant Science Centre, 200615. m/0.18 mm/0.18 μm, 70. C @ 2. min, 40. K/min, 320. C @ 1. min

References

Umeå Plant Science Centre, 2006
Umeå Plant Science Centre, The Metabolomics facility, RTI data. Compound identification, 2006, retrieved from http://www.upsc.se/metabolomics.htm. [all data]