Furfuryl pentyl sulfide

Kovats' RI, non-polar column, isothermal

View large format table.

Column type Active phase Temperature (C) I Reference Comment
CapillaryOV-101120.1352.Misharina, Aerov, et al., 1988Column length: 50. m; Column diameter: 0.32 mm
CapillaryOV-101130.1354.Misharina, Aerov, et al., 1988Column length: 50. m; Column diameter: 0.32 mm
CapillaryOV-101140.1356.Misharina, Aerov, et al., 1988Column length: 50. m; Column diameter: 0.32 mm

Van Den Dool and Kratz RI, non-polar column, temperature ramp

View large format table.

Column type Active phase I Reference Comment
CapillaryOV-1011349.Misharina, Aerov, et al., 19884. K/min; Column length: 50. m; Column diameter: 0.32 mm; Tstart: 50. C; Tend: 250. C
CapillaryOV-1011354.Misharina, Aerov, et al., 19888. K/min; Column length: 50. m; Column diameter: 0.32 mm; Tstart: 50. C; Tend: 250. C
CapillaryOV-1011346.Misharina, Aerov, et al., 19882. K/min; Column length: 50. m; Column diameter: 0.32 mm; Tstart: 80. C; Tend: 250. C

References

Misharina, Aerov, et al., 1988
Misharina, T.A.; Aerov, A.F.; Golovnya, R.V.; Stepanova, O.V.; Vysotskaya, L.E.; Gren, A.I., Retention indices of alkylfurfurylsulfides in isothermal and temperature-programmed capillary chromatography, Zh. Anal. Khim., 1988, 43, 8, 1489-1493. [all data]